BDBM50128810 CHEMBL3629192
SMILES NC(=S)N\N=C(/c1ccccc1)c1cc(cc(c1)C(=O)c1ccccc1)C(=O)c1ccccc1
InChI Key InChIKey=HNHJQJITMSHEFD-QCWLDUFUSA-N
Data  2 IC50
  Tab Delimited (TSV)   2D SDfile   Computed 3D by Vconf -m prep SDfile
Find this compound or compounds like it in BindingDB:
Activity Spreadsheet -- Enzyme Inhibition Constant Data from BindingDB
Found 2 hits for monomerid = 50128810
TargetCathepsin B(Homo sapiens (Human))
Baylor University
Curated by ChEMBL
LigandPNGBDBM50128810(CHEMBL3629192)
Affinity DataIC50: >1.00E+4nM. Assay description: Inhibition of human liver cathepsin B using Z-RR-AMC as substrate after 5 mins by fluorescence assay
In DepthDetails ArticlePubMed
TargetProcathepsin L(Homo sapiens (Human))
Baylor University
Curated by ChEMBL
LigandPNGBDBM50128810(CHEMBL3629192)
Affinity DataIC50:  56nM. Assay description: Inhibition of human liver cathepsin L using Z-FR-AMC as substrate measured every 15 sec for 5 mins by fluorescence assay
In DepthDetails ArticlePubMed