BDBM50128864 2-(16-Chloro-17,19-dihydroxy-4-methyl-2-oxo-3,7-dioxa-tricyclo[13.4.0.0*6,8*]nonadeca-1(19),9,11,15,17-pentaen-13-ylideneaminooxy)-N-(2-ethoxy-ethyl)-acetamide::CHEMBL85010
SMILES CCOCCNC(=O)CO\N=C1\Cc2c(Cl)c(O)cc(O)c2C(=O)O[C@H](C)C[C@H]2O[C@@H]2/C=C\C=C\1
InChI Key InChIKey=PHPBXALSGRFDIK-SWHMRWTFSA-N
Data  1 IC50
  Tab Delimited (TSV)   2D SDfile   Computed 3D by Vconf -m prep SDfile
Find this compound or compounds like it in BindingDB:
Activity Spreadsheet -- Enzyme Inhibition Constant Data from BindingDB
Found 1 hit for monomerid = 50128864
TargetProto-oncogene tyrosine-protein kinase Src(Rattus norvegicus)
Pharmaceutical Research Institute
Curated by ChEMBL
LigandPNGBDBM50128864(2-(16-Chloro-17,19-dihydroxy-4-methyl-2-oxo-3,7-di...)
Affinity DataIC50: >1.00E+3nM. Assay description: Inhibition of v-Src tyrosine kinase autophosphorylation in SR3Y1 cells after 15 hr exposure
In DepthDetails ArticlePubMed