BDBM50128920 (3R,3aS)-7-[3-(3-Chloro-benzylamino)-propyl]-2,3,3a,9b-tetrahydro-1H-cyclopenta[c]quinolin-4-ylamine::CHEMBL162416::CHEMBL545441
SMILES NC1=Nc2cc(CCCNCc3cccc(Cl)c3)ccc2[C@H]2CCC[C@@H]12
InChI Key InChIKey=TXHAPORLDDIXMY-UYAOXDASSA-N
Data  6 IC50
  Tab Delimited (TSV)   2D SDfile   Computed 3D by Vconf -m prep SDfile
Find this compound or compounds like it in BindingDB:
Activity Spreadsheet -- Enzyme Inhibition Constant Data from BindingDB
Found 6 hits for monomerid = 50128920
TargetNitric oxide synthase, inducible(Homo sapiens (Human))
Schering
Curated by ChEMBL
LigandPNGBDBM50128920((3R,3aS)-7-[3-(3-Chloro-benzylamino)-propyl]-2,3,3...)
Affinity DataIC50:  580nM. Assay description: Inhibition of human inducible nitric oxide synthase
In DepthDetails ArticlePubMed
TargetNitric oxide synthase, endothelial(Homo sapiens (Human))
Schering
Curated by ChEMBL
LigandPNGBDBM50128920((3R,3aS)-7-[3-(3-Chloro-benzylamino)-propyl]-2,3,3...)
Affinity DataIC50:  9.40E+3nM. Assay description: Inhibition of human endothelial nitric oxide synthase
In DepthDetails ArticlePubMed
TargetNitric oxide synthase, endothelial(Homo sapiens (Human))
Schering
Curated by ChEMBL
LigandPNGBDBM50128920((3R,3aS)-7-[3-(3-Chloro-benzylamino)-propyl]-2,3,3...)
Affinity DataIC50:  9.40E+3nM. Assay description: Inhibitory concentration against recombinant human Endothelial nitric oxide synthase
In DepthDetails ArticlePubMed
TargetNitric oxide synthase, brain(Homo sapiens (Human))
Schering
Curated by ChEMBL
LigandPNGBDBM50128920((3R,3aS)-7-[3-(3-Chloro-benzylamino)-propyl]-2,3,3...)
Affinity DataIC50:  42nM. Assay description: Inhibitory concentration against recombinant human (neuronal nitric oxide synthase) n-NOS
In DepthDetails ArticlePubMed
TargetNitric oxide synthase, inducible(Homo sapiens (Human))
Schering
Curated by ChEMBL
LigandPNGBDBM50128920((3R,3aS)-7-[3-(3-Chloro-benzylamino)-propyl]-2,3,3...)
Affinity DataIC50:  580nM. Assay description: Inhibitory concentration against human Inducible nitric oxide synthase
In DepthDetails ArticlePubMed
TargetNitric oxide synthase, brain(Homo sapiens (Human))
Schering
Curated by ChEMBL
LigandPNGBDBM50128920((3R,3aS)-7-[3-(3-Chloro-benzylamino)-propyl]-2,3,3...)
Affinity DataIC50:  42nM. Assay description: Inhibition of human neuronal nitric oxide synthase
In DepthDetails ArticlePubMed