BDBM50128976 2-(4-Hydroxy-piperidin-1-yl)-1H-pyrrolo[3,2-b]pyridine-3-carbonitrile::CHEMBL61540
SMILES OC1CCN(CC1)c1[nH]c2cccnc2c1C#N
InChI Key InChIKey=SQHYLZJVNVOFRE-UHFFFAOYSA-N
Data  1 EC50
  Tab Delimited (TSV)   2D SDfile   Computed 3D by Vconf -m prep SDfile
Find this compound or compounds like it in BindingDB:
Activity Spreadsheet -- Enzyme Inhibition Constant Data from BindingDB
Found 1 hit for monomerid = 50128976
TargetCalcium-activated potassium channel subunit alpha-1(Homo sapiens (Human))
Abbott Laboratories
Curated by ChEMBL
LigandPNGBDBM50128976(2-(4-Hydroxy-piperidin-1-yl)-1H-pyrrolo[3,2-b]pyri...)
Affinity DataEC50:  1.51E+4nM. Assay description: [86Rb+] efflux induced by BKca alpha subunits expressed in HEK293 cells at 10 microM
In DepthDetails ArticlePubMed