BDBM50129126 (5E)-7-Oxozeaenol::CHEBI:67558::CHEMBL1801950::US10434085, Compound (5E)-7-oxozeaenol
SMILES COc1cc(O)c2c(c1)\C=C\C[C@H](O)[C@H](O)C(=O)\C=C\C[C@H](C)OC2=O
InChI Key InChIKey=NEQZWEXWOFPKOT-ULSULSEOSA-N
Data  2 IC50
PDB links: 3 PDB IDs match this monomer.
  Tab Delimited (TSV)   2D SDfile   Computed 3D by Vconf -m prep SDfile
Find this compound or compounds like it in BindingDB:
Activity Spreadsheet -- Enzyme Inhibition Constant Data from BindingDB
Found 2 hits for monomerid = 50129126
TargetMitogen-activated protein kinase kinase kinase 7(Homo sapiens (Human))
University Of North Carolina At Greensboro
US Patent
LigandPNGBDBM50129126((5E)-7-Oxozeaenol | CHEBI:67558 | CHEMBL1801950 | ...)
Affinity DataIC50:  1.30E+3nM. Assay description: The assay was performed at BSP Biosience Inc. (5Z)-7-oxozeaenol was used as a positive control. Analogue 3 was not tested due to the short-term stabi...
TargetMitogen-activated protein kinase kinase kinase 7(Homo sapiens (Human))
University Of North Carolina At Greensboro
US Patent
LigandPNGBDBM50129126((5E)-7-Oxozeaenol | CHEBI:67558 | CHEMBL1801950 | ...)
Affinity DataIC50:  1.30E+3nM. Assay description: Inhibition of TAK1 (unknown origin)