BDBM50129170 7-Chloro-2,2,4-trimethyl-2,5-dihydro-1H-6-oxa-1-aza-chrysene::7-chloro-2,2,4-trimethyl-2,5-dihydro-1H-chromeno[3,4-f]quinoline::CHEMBL62714
SMILES CC1=CC(C)(C)Nc2ccc-3c(COc4c(Cl)cccc-34)c12
InChI Key InChIKey=CNWYJEBZDCMMPO-UHFFFAOYSA-N
Data  2 KI  1 IC50  1 EC50
  Tab Delimited (TSV)   2D SDfile   Computed 3D by Vconf -m prep SDfile
Find this compound or compounds like it in BindingDB:
Activity Spreadsheet -- Enzyme Inhibition Constant Data from BindingDB
Found 4 hits for monomerid = 50129170
TargetProgesterone receptor(Homo sapiens (Human))
Ligand Pharmaceuticals
Curated by ChEMBL
LigandPNGBDBM50129170(7-Chloro-2,2,4-trimethyl-2,5-dihydro-1H-6-oxa-1-az...)
Affinity DataKi:  273nM. Assay description: Binding affinity at human progesterone receptor.
In DepthDetails ArticlePubMed
TargetProgesterone receptor(Homo sapiens (Human))
Ligand Pharmaceuticals
Curated by ChEMBL
LigandPNGBDBM50129170(7-Chloro-2,2,4-trimethyl-2,5-dihydro-1H-6-oxa-1-az...)
Affinity DataKi:  275nM. Assay description: Displacement of [3H]progesterone from Progesterone receptor
In DepthDetails ArticlePubMed
TargetProgesterone receptor(Homo sapiens (Human))
Ligand Pharmaceuticals
Curated by ChEMBL
LigandPNGBDBM50129170(7-Chloro-2,2,4-trimethyl-2,5-dihydro-1H-6-oxa-1-az...)
Affinity DataIC50:  782nM. Assay description: Effective concentration for human progesterone in T47D human breast cancer cell
In DepthDetails ArticlePubMed
TargetProgesterone receptor(Homo sapiens (Human))
Ligand Pharmaceuticals
Curated by ChEMBL
LigandPNGBDBM50129170(7-Chloro-2,2,4-trimethyl-2,5-dihydro-1H-6-oxa-1-az...)
Affinity DataEC50:  576nM. Assay description: Antagonistic activity at human progesterone receptor in CV-1 cells.
In DepthDetails ArticlePubMed