BDBM50129528 2-[5-(2',4'-Dichloro-biphenyl-4-yl)-3-tetrazol-1-yl-pyrazol-1-yl]-pyridine::CHEMBL308349
SMILES Clc1ccc(c(Cl)c1)-c1ccc(cc1)-c1cc(nn1-c1ccccn1)-n1cnnn1
InChI Key InChIKey=XSQZDTHEDIJOJK-UHFFFAOYSA-N
Data  3 IC50
  Tab Delimited (TSV)   2D SDfile   Computed 3D by Vconf -m prep SDfile
Find this compound or compounds like it in BindingDB:
Activity Spreadsheet -- Enzyme Inhibition Constant Data from BindingDB
Found 3 hits for monomerid = 50129528
TargetMethionine--tRNA ligase, cytoplasmic(Homo sapiens (Human))
Cubist Pharmaceutical
Curated by ChEMBL
LigandPNGBDBM50129528(2-[5-(2',4'-Dichloro-biphenyl-4-yl)-3-tetrazol-1-y...)
Affinity DataIC50:  1.79E+3nM. Assay description: Inhibitory activity against Enterococci faecalis methionyl-tRNA synthetase (EfMetRS)
In DepthDetails ArticlePubMed
TargetMethionine--tRNA ligase, cytoplasmic(Homo sapiens (Human))
Cubist Pharmaceutical
Curated by ChEMBL
LigandPNGBDBM50129528(2-[5-(2',4'-Dichloro-biphenyl-4-yl)-3-tetrazol-1-y...)
Affinity DataIC50:  150nM. Assay description: Inhibitory activity against Staphylococcus aureus methionyl-tRNA synthetase (SaMetRS)
In DepthDetails ArticlePubMed
TargetMethionine--tRNA ligase, cytoplasmic(Homo sapiens (Human))
Cubist Pharmaceutical
Curated by ChEMBL
LigandPNGBDBM50129528(2-[5-(2',4'-Dichloro-biphenyl-4-yl)-3-tetrazol-1-y...)
Affinity DataIC50:  2.50E+4nM. Assay description: Inhibitory activity against Enterococci faecalis methionyl-tRNA synthetase (EfMetRS)
In DepthDetails ArticlePubMed