BDBM50129611 4-(1-Diethylaminomethyl-vinyl)-phenol::CHEMBL315432
SMILES CCN(CC)CC(=C)c1ccc(O)cc1
InChI Key InChIKey=YBUVUEDJFYLBPT-UHFFFAOYSA-N
Data  1 KI
  Tab Delimited (TSV)   2D SDfile   Computed 3D by Vconf -m prep SDfile
Find this compound or compounds like it in BindingDB:
Activity Spreadsheet -- Enzyme Inhibition Constant Data from BindingDB
Found 1 hit for monomerid = 50129611
TargetSynaptic vesicular amine transporter(Bos taurus)
Wichita State University
Curated by ChEMBL
LigandPNGBDBM50129611(4-(1-Diethylaminomethyl-vinyl)-phenol | CHEMBL3154...)
Affinity DataKi:  2.02E+5nM. Assay description: Inhibitory constant for dopamine uptake into resealed bovine chromaffin granule ghosts through the vesicular monoamine transporter
In DepthDetails ArticlePubMed