BDBM50129778 6-(3-Ethyl-4-methyl-phenylamino)-3-(4-piperazin-1-yl-butyl)-1H-pyrimidine-2,4-dione; Dihydrochloride::CHEMBL553529
SMILES CCc1cc(Nc2cc(=O)n(CCCCN3CCNCC3)c(=O)[nH]2)ccc1C
InChI Key InChIKey=LAHDYDOFJIJSPE-UHFFFAOYSA-N
Data  1 KI
  Tab Delimited (TSV)   2D SDfile   Computed 3D by Vconf -m prep SDfile
Find this compound or compounds like it in BindingDB:
Activity Spreadsheet -- Enzyme Inhibition Constant Data from BindingDB
Found 1 hit for monomerid = 50129778
TargetDNA polymerase III PolC-type(Bacillus subtilis)
Glsynthesis
Curated by ChEMBL
LigandPNGBDBM50129778(6-(3-Ethyl-4-methyl-phenylamino)-3-(4-piperazin-1-...)
Affinity DataKi:  30nM. Assay description: Inhibitory activity against DNA polymerase IIIC from Bacillus subtilis was determined
In DepthDetails ArticlePubMed