BDBM50129937 1-{2-[2-(Pyridin-2-ylamino)-ethylamino]-acetyl}-pyrrolidine-2-carbonitrile::CHEMBL92711
SMILES O=C(CNCCNc1ccccn1)N1CCC[C@H]1C#N
InChI Key InChIKey=STWTYQOXUTUWAW-LBPRGKRZSA-N
Data  1 IC50
  Tab Delimited (TSV)   2D SDfile   Computed 3D by Vconf -m prep SDfile
Find this compound or compounds like it in BindingDB:
Activity Spreadsheet -- Enzyme Inhibition Constant Data from BindingDB
Found 1 hit for monomerid = 50129937
TargetDipeptidyl peptidase 4(Homo sapiens (Human))
Novartis Institute For Biomedical Research
Curated by ChEMBL
LigandPNGBDBM50129937(1-{2-[2-(Pyridin-2-ylamino)-ethylamino]-acetyl}-py...)
Affinity DataIC50:  33nM. Assay description: Inhibition of human dipeptidyl peptidase IV (DPP IV) obtained from human colonic carcinoma cells
In DepthDetails ArticlePubMed