BDBM50130227 6-Chloro-9H-beta-carbolin-8-ylamine::CHEMBL81781
SMILES Nc1cc(Cl)cc2c3cc[nH]cc3nc12
InChI Key InChIKey=FABOSUOOKGJVIC-UHFFFAOYSA-N
Data  1 IC50
  Tab Delimited (TSV)   2D SDfile   Computed 3D by Vconf -m prep SDfile
Find this compound or compounds like it in BindingDB:
Activity Spreadsheet -- Enzyme Inhibition Constant Data from BindingDB
Found 1 hit for monomerid = 50130227
TargetInhibitor of nuclear factor kappa-B kinase subunit alpha(Homo sapiens (Human))
Millennium Pharmaceuticals
Curated by ChEMBL
LigandPNGBDBM50130227(6-Chloro-9H-beta-carbolin-8-ylamine | CHEMBL81781)
Affinity DataIC50:  1.30E+3nM. Assay description: Inhibitory activity against IkappaB kinase(IKK) isolated from HeLa cells activated with recombinant MEEK1 in an ELISA phosphorylaton assay.
In DepthDetails ArticlePubMed