BDBM50130516 (+/-)-(3aS*,5R*,6aS*)-5-amino-4,5,6,6a-tetrahydro-3aH-cyclopenta[d]isoxazole-3,5-dicarboxylic acid::(3aS,5R,6aS)-5-Amino-4,5,6,6a-tetrahydro-3aH-cyclopenta[d]isoxazole-3,5-dicarboxylic acid::5-Amino-4,5,6,6a-tetrahydro-3aH-cyclopenta[d]isoxazole-3,5-dicarboxylic acid::CHEMBL421402
SMILES N[C@]1(C[C@@H]2ON=C([C@@H]2C1)C(O)=O)C(O)=O
InChI Key InChIKey=NTVFQKSMRLANLZ-PDJPSNROSA-N
Data  5 KI  2 EC50
  Tab Delimited (TSV)   2D SDfile   Computed 3D by Vconf -m prep SDfile
Find this compound or compounds like it in BindingDB:
Activity Spreadsheet -- Enzyme Inhibition Constant Data from BindingDB
Found 7 hits for monomerid = 50130516
TargetMetabotropic glutamate receptor 1(RAT)
Università
Curated by ChEMBL
LigandPNGBDBM50130516((+/-)-(3aS*,5R*,6aS*)-5-amino-4,5,6,6a-tetrahydro-...)
Affinity DataKi:  9.40E+4nM. Assay description: Inhibitory constant of the compound against cloned rat Metabotropic glutamate receptor 1 expressed in Chinese Hamster Ovary (CHO) cells
In DepthDetails ArticlePubMed
TargetMetabotropic glutamate receptor 1(RAT)
Università
Curated by ChEMBL
LigandPNGBDBM50130516((+/-)-(3aS*,5R*,6aS*)-5-amino-4,5,6,6a-tetrahydro-...)
Affinity DataKi:  9.50E+4nM. Assay description: Binding affinity for mGluR1 receptor expressed in CHO cells
In DepthDetails ArticlePubMed
TargetMetabotropic glutamate receptor 5(Rattus norvegicus (Rat))
Università
Curated by ChEMBL
LigandPNGBDBM50130516((+/-)-(3aS*,5R*,6aS*)-5-amino-4,5,6,6a-tetrahydro-...)
Affinity DataKi:  6.40E+5nM. Assay description: Inhibitory constant of the compound against cloned rat Metabotropic glutamate receptor 5 expressed in Chinese Hamster Ovary (CHO) cells
In DepthDetails ArticlePubMed
TargetMetabotropic glutamate receptor 4(Rattus norvegicus (Rat))
Università
Curated by ChEMBL
LigandPNGBDBM50130516((+/-)-(3aS*,5R*,6aS*)-5-amino-4,5,6,6a-tetrahydro-...)
Affinity DataKi: >1.00E+6nM. Assay description: Binding affinity for mGluR4 receptor expressed in CHO cells
In DepthDetails ArticlePubMed
TargetMetabotropic glutamate receptor 4(Rattus norvegicus (Rat))
Università
Curated by ChEMBL
LigandPNGBDBM50130516((+/-)-(3aS*,5R*,6aS*)-5-amino-4,5,6,6a-tetrahydro-...)
Affinity DataKi: >1.00E+6nM. Assay description: Inhibitory constant of the compound against cloned rat Metabotropic glutamate receptor 4 expressed in Chinese Hamster Ovary (CHO) cells
In DepthDetails ArticlePubMed
TargetMetabotropic glutamate receptor 4(Rattus norvegicus (Rat))
Università
Curated by ChEMBL
LigandPNGBDBM50130516((+/-)-(3aS*,5R*,6aS*)-5-amino-4,5,6,6a-tetrahydro-...)
Affinity DataEC50: >1.00E+6nM. Assay description: Activity of the compound tested at cloned rat Metabotropic glutamate receptor 4 expressed in Chinese Hamster Ovary (CHO) cells
In DepthDetails ArticlePubMed
TargetMetabotropic glutamate receptor 4(Rattus norvegicus (Rat))
Università
Curated by ChEMBL
LigandPNGBDBM50130516((+/-)-(3aS*,5R*,6aS*)-5-amino-4,5,6,6a-tetrahydro-...)
Affinity DataEC50: >1.00E+6nM. Assay description: Effective concentration against mGluR4 receptor expressed in CHO cells
In DepthDetails ArticlePubMed