BDBM50130557 CHEMBL3632882
SMILES CCOC(=O)CN(c1ccc(NS(=O)(=O)c2ccc(OC)cc2)c2ccccc12)S(=O)(=O)c1ccc(OC)cc1
InChI Key InChIKey=DDNHMWFOTGZHOR-UHFFFAOYSA-N
Data  2 IC50  1 Kd
  Tab Delimited (TSV)   2D SDfile   Computed 3D by Vconf -m prep SDfile
Find this compound or compounds like it in BindingDB:
Activity Spreadsheet -- Enzyme Inhibition Constant Data from BindingDB
Found 3 hits for monomerid = 50130557
TargetKelch-like ECH-associated protein 1(Homo sapiens (Human))
University Of Illinois At Chicago
Curated by ChEMBL
LigandPNGBDBM50130557(CHEMBL3632882)
Affinity DataIC50:  400nM. Assay description: Binding affinity to the Keap1 (321 to 609 residues) (unknown origin) expressed in Escherichia coli BL21 (DE3) cells by surface plasmon resonance assa...
In DepthDetails ArticlePubMed
TargetKelch-like ECH-associated protein 1(Homo sapiens (Human))
University Of Illinois At Chicago
Curated by ChEMBL
LigandPNGBDBM50130557(CHEMBL3632882)
Affinity DataKd:  400nM. Assay description: Inhibition of Keap1-Nrf2 (unknown origin) protein-protein interaction by SPR assay
In DepthDetails PubMed
TargetKelch-like ECH-associated protein 1(Homo sapiens (Human))
University Of Illinois At Chicago
Curated by ChEMBL
LigandPNGBDBM50130557(CHEMBL3632882)
Affinity DataIC50:  85nM. Assay description: Inhibition of Keap1-Nrf2 (unknown origin) protein-protein interaction expressed in Escherichia coli BL21 codon plus cells using FITC-beta-DEETGEF-OH ...
In DepthDetails PubMed