BDBM50130778 (4-Bromo-phenyl)-{4-[6-(cyclopropyl-methyl-amino)-hexyloxy]-phenyl}-methanone; hydrochloride::CHEMBL544345::CHEMBL612027
SMILES CN(CCCCCCOc1ccc(cc1)C(=O)c1ccc(Br)cc1)C1CC1
InChI Key InChIKey=KWJVSKUVDKZNDX-UHFFFAOYSA-N
Data  2 IC50
  Tab Delimited (TSV)   2D SDfile   Computed 3D by Vconf -m prep SDfile
Find this compound or compounds like it in BindingDB:
Activity Spreadsheet -- Enzyme Inhibition Constant Data from BindingDB
Found 2 hits for monomerid = 50130778
TargetLanosterol synthase(Homo sapiens (Human))
Universit£
Curated by ChEMBL
LigandPNGBDBM50130778((4-Bromo-phenyl)-{4-[6-(cyclopropyl-methyl-amino)-...)
Affinity DataIC50:  35nM. Assay description: Inhibition of oxidosqualene cyclase
In DepthDetails ArticlePubMed
TargetLanosterol synthase(Homo sapiens (Human))
Universit£
Curated by ChEMBL
LigandPNGBDBM50130778((4-Bromo-phenyl)-{4-[6-(cyclopropyl-methyl-amino)-...)
Affinity DataIC50:  35.3nM. Assay description: In vitro inhibition of human 2,3-oxidosqualene cyclase.
In DepthDetails ArticlePubMed