BDBM50130827 CHEMBL423145::[4-(8-Indol-1-yl-octyloxycarbonylmethyl)-phenyl]-trimethyl-ammonium; iodide
SMILES C[N+](C)(C)c1ccc(CC(=O)OCCCCCCCCn2ccc3ccccc23)cc1
InChI Key InChIKey=IDCAFLAESOUUJU-UHFFFAOYSA-N
Data  1 IC50
  Tab Delimited (TSV)   2D SDfile   Computed 3D by Vconf -m prep SDfile
Find this compound or compounds like it in BindingDB:
Activity Spreadsheet -- Enzyme Inhibition Constant Data from BindingDB
Found 1 hit for monomerid = 50130827
TargetNH(3)-dependent NAD(+) synthetase(Bacillus subtilis)
University Of Alabama At Birmingham
Curated by ChEMBL
LigandPNGBDBM50130827(CHEMBL423145 | [4-(8-Indol-1-yl-octyloxycarbonylme...)
Affinity DataIC50:  6.30E+4nM. Assay description: Inhibitory activity against Bacillus subtilis NAD synthetase
In DepthDetails ArticlePubMed