BDBM50130882 CHEMBL406127::DTPA-DLys-Pro-Arg-Gly(PipAm)-Arg-Pro-Tyr-tBuGly-Leu-OH
SMILES CC(C)C[C@H](NC(=O)[C@@H](NC(=O)[C@H](Cc1ccc(O)cc1)NC(=O)[C@@H]1CCCN1C(=O)[C@H](CCCNC(N)=N)NC(=O)[C@@H](NC(=O)C1CCCN1C(=O)[C@@H](CCCCN)NC(=O)CN(CCN(CCN(CC(O)=O)CC(O)=O)CC(O)=O)CC(O)=O)C1CCN(CC1)C(N)=N)C(C)(C)C)C(O)=O
InChI Key InChIKey=VAGIECZDTWVQJG-GPUVQHHFSA-N
Data  1 IC50
  Tab Delimited (TSV)   2D SDfile   Computed 3D by Vconf -m prep SDfile
Find this compound or compounds like it in BindingDB:
Activity Spreadsheet -- Enzyme Inhibition Constant Data from BindingDB
Found 1 hit for monomerid = 50130882
TargetNeurotensin receptor type 1(Homo sapiens (Human))
Washington University
Curated by ChEMBL
LigandPNGBDBM50130882(CHEMBL406127 | DTPA-DLys-Pro-Arg-Gly(PipAm)-Arg-Pr...)
Affinity DataIC50:  0.400nM. Assay description: Binding affinity towards neurotensin receptor in membranes prepared from HT-29 cell line, relative to [111In]-labeled neurotensin peptide
In DepthDetails ArticlePubMed