BDBM50130896 CHEMBL437707::DTPA-DTyr-Glu-Asn-Lys-Pro-Gly(PipAm)-Arg-Pro-Tyr-tBuGly-Leu-OH
SMILES CC(C)C[C@H](NC(=O)[C@@H](NC(=O)[C@H](Cc1ccc(O)cc1)NC(=O)[C@@H]1CCCN1C(=O)[C@H](CCCNC(N)=N)NC(=O)[C@@H](NC(=O)[C@@H]1CCCN1C(=O)NC(=O)[C@H](CCCCN)NC(=O)[C@H](CC(N)=O)NC(=O)[C@H](CCC(O)=O)NC(=O)[C@H](Cc1ccc(O)cc1)NC(=O)CN(CCN(CCN(CC(O)=O)CC(O)=O)CC(O)=O)CC(O)=O)C1CCN(CC1)C(N)=N)C(C)(C)C)C(O)=O
InChI Key InChIKey=GTBKZNUYHWSCDC-JEYXRXBTSA-N
Data  1 IC50
  Tab Delimited (TSV)   2D SDfile   Computed 3D by Vconf -m prep SDfile
Find this compound or compounds like it in BindingDB:
Activity Spreadsheet -- Enzyme Inhibition Constant Data from BindingDB
Found 1 hit for monomerid = 50130896
TargetNeurotensin receptor type 1(Homo sapiens (Human))
Washington University
Curated by ChEMBL
LigandPNGBDBM50130896(CHEMBL437707 | DTPA-DTyr-Glu-Asn-Lys-Pro-Gly(PipAm...)
Affinity DataIC50:  1.5nM. Assay description: Binding affinity towards neurotensin receptor in membranes prepared from HT-29 cell line, relative to [111In]-labeled neurotensin peptide
In DepthDetails ArticlePubMed