BDBM50130897 CHEMBL410289::DTPA-DLys-Pro-Arg-Gly(PipAm)-Arg-ACA-Tyr-tBuGly-Leu-OH
SMILES [#6]-[#6](-[#6])-[#6]-[#6@H](-[#7]-[#6](=O)-[#6@@H](-[#7]-[#6](=O)-[#6@H](-[#6]-c1ccc(-[#8])cc1)-[#7]-[#6](=O)-[#6@@H]-1-[#6]-[#6]-[#7]-1-[#6](=O)-[#6@H](-[#6]-[#6]-[#6]-[#7]-[#6](-[#7])=[#7])-[#7]-[#6](=O)-[#6@@H](-[#7]-[#6](=O)-[#6@H](-[#6]-[#6]-[#6]\[#7]=[#6](\[#7])-[#7])-[#7]-[#6](=O)-[#6@@H]-1-[#6]-[#6]-[#6]-[#7]-1-[#6](=O)-[#6@@H](-[#6]-[#6]-[#6]-[#6]-[#7])-[#7]-[#6](=O)-[#6]-[#7](-[#6]-[#6]-[#7](-[#6]-[#6]-[#7](-[#6]-[#6](-[#8])=O)-[#6]-[#6](-[#8])=O)-[#6]-[#6](-[#8])=O)-[#6]-[#6](-[#8])=O)-[#6]-1-[#6]-[#6]-[#7](-[#6]-[#6]-1)-[#6](-[#7])=[#7])C([#6])([#6])[#6])-[#6](-[#8])=O
InChI Key InChIKey=YCOJFMULTKCTGW-YPOZYFJESA-N
Data  1 IC50
  Tab Delimited (TSV)   2D SDfile   Computed 3D by Vconf -m prep SDfile
Find this compound or compounds like it in BindingDB:
Activity Spreadsheet -- Enzyme Inhibition Constant Data from BindingDB
Found 1 hit for monomerid = 50130897
TargetNeurotensin receptor type 1(Homo sapiens (Human))
Washington University
Curated by ChEMBL
LigandPNGBDBM50130897(CHEMBL410289 | DTPA-DLys-Pro-Arg-Gly(PipAm)-Arg-AC...)
Affinity DataIC50:  113nM. Assay description: Binding affinity towards neurotensin receptor in membranes prepared from HT-29 cell line, relative to [111In]-labeled neurotensin peptide
In DepthDetails ArticlePubMed