BDBM50130923 CHEMBL81583::N-{3-[2-(3,4-Dihydroxy-phenylcarbamoyl)-ethyl]-phenyl}-2-hydroxy-benzamide
SMILES Oc1ccc(NC(=O)CCc2cccc(NC(=O)c3ccccc3O)c2)cc1O
InChI Key InChIKey=CSCXAVUOGXHLMT-UHFFFAOYSA-N
Data  1 IC50
  Tab Delimited (TSV)   2D SDfile   Computed 3D by Vconf -m prep SDfile
Find this compound or compounds like it in BindingDB:
Activity Spreadsheet -- Enzyme Inhibition Constant Data from BindingDB
Found 1 hit for monomerid = 50130923
TargetPolyunsaturated fatty acid lipoxygenase ALOX15(Homo sapiens (Human))
Aston University
Curated by ChEMBL
LigandPNGBDBM50130923(CHEMBL81583 | N-{3-[2-(3,4-Dihydroxy-phenylcarbamo...)
Affinity DataIC50:  1.67E+3nM. Assay description: In vitro inhibitory activity of compound on rabbit reticulocyte 15-lipoxygenase
In DepthDetails ArticlePubMed