BDBM50130981 3-[2-(4-Bromo-benzyloxy)-phenyl]-5-chloromethyl-isoxazole::CHEMBL83758
SMILES ClCc1cc(no1)-c1ccccc1OCc1ccc(Br)cc1
InChI Key InChIKey=WWPOLSXCEBBWCP-UHFFFAOYSA-N
Data  1 Kd
  Tab Delimited (TSV)   2D SDfile   Computed 3D by Vconf -m prep SDfile
Find this compound or compounds like it in BindingDB:
Activity Spreadsheet -- Enzyme Inhibition Constant Data from BindingDB
Found 1 hit for monomerid = 50130981
TargetCystic fibrosis transmembrane conductance regulator(Rattus norvegicus)
University Of California
Curated by ChEMBL
LigandPNGBDBM50130981(3-[2-(4-Bromo-benzyloxy)-phenyl]-5-chloromethyl-is...)
Affinity DataKd:  2.20E+5nM. Assay description: Kd (half effective concentration) of compound against CFTR (cystic fibrosis transmembrane conductance regulator) in rat was determined
In DepthDetails ArticlePubMed