BDBM50130986 2-{3-[2-(3-Methoxy-benzyloxy)-phenyl]-isoxazol-5-yl}-ethanol::CHEMBL310410
SMILES COc1cccc(COc2ccccc2-c2cc(CCO)on2)c1
InChI Key InChIKey=OAPWRWZGDMGABU-UHFFFAOYSA-N
Data  1 Kd
  Tab Delimited (TSV)   2D SDfile   Computed 3D by Vconf -m prep SDfile
Find this compound or compounds like it in BindingDB:
Activity Spreadsheet -- Enzyme Inhibition Constant Data from BindingDB
Found 1 hit for monomerid = 50130986
TargetCystic fibrosis transmembrane conductance regulator(Rattus norvegicus)
University Of California
Curated by ChEMBL
LigandPNGBDBM50130986(2-{3-[2-(3-Methoxy-benzyloxy)-phenyl]-isoxazol-5-y...)
Affinity DataKd:  1.77E+5nM. Assay description: Kd (half effective concentration) of compound against CFTR (cystic fibrosis transmembrane conductance regulator) in rat was determined
In DepthDetails ArticlePubMed