BDBM50130988 2-{3-[2-(4-Methoxy-benzyloxy)-phenyl]-isoxazol-5-yl}-ethanol::CHEMBL313066
SMILES COc1ccc(COc2ccccc2-c2cc(CCO)on2)cc1
InChI Key InChIKey=IVCAQTKUOJSAJM-UHFFFAOYSA-N
Data  1 Kd
  Tab Delimited (TSV)   2D SDfile   Computed 3D by Vconf -m prep SDfile
Find this compound or compounds like it in BindingDB:
Activity Spreadsheet -- Enzyme Inhibition Constant Data from BindingDB
Found 1 hit for monomerid = 50130988
TargetCystic fibrosis transmembrane conductance regulator(Rattus norvegicus)
University Of California
Curated by ChEMBL
LigandPNGBDBM50130988(2-{3-[2-(4-Methoxy-benzyloxy)-phenyl]-isoxazol-5-y...)
Affinity DataKd:  6.10E+4nM. Assay description: Kd (half effective concentration) of compound against CFTR (cystic fibrosis transmembrane conductance regulator) in rat was determined
In DepthDetails ArticlePubMed