BDBM50131042 3-Bromo-8,13-dihydro-7H-indolo[2',3':3,4]pyrido[2,1-b]quinazolin-5-one::CHEMBL85960
SMILES Brc1ccc2nc3-c4[nH]c5ccccc5c4CCn3c(=O)c2c1
InChI Key InChIKey=JYRZNTDXOMXNIW-UHFFFAOYSA-N
Data  3 IC50
  Tab Delimited (TSV)   2D SDfile   Computed 3D by Vconf -m prep SDfile
Find this compound or compounds like it in BindingDB:
Activity Spreadsheet -- Enzyme Inhibition Constant Data from BindingDB
Found 3 hits for monomerid = 50131042
TargetCytochrome P450 1B1(Homo sapiens (Human))
National Research Institute Of Chinese Medicine
Curated by ChEMBL
LigandPNGBDBM50131042(3-Bromo-8,13-dihydro-7H-indolo[2',3':3,4]pyrido[2,...)
Affinity DataIC50:  120nM. Assay description: Inhibition of Cytochrome P450 1B1 enzyme in bacterial membrane expressing human P450s
In DepthDetails ArticlePubMed
TargetCytochrome P450 1A2(Homo sapiens (Human))
National Research Institute Of Chinese Medicine
Curated by ChEMBL
LigandPNGBDBM50131042(3-Bromo-8,13-dihydro-7H-indolo[2',3':3,4]pyrido[2,...)
Affinity DataIC50:  1.50E+3nM. Assay description: Inhibition of Cytochrome P450 1A2 enzyme in bacterial membrane expressing human P450s
In DepthDetails ArticlePubMed
TargetCytochrome P450 1A1(Homo sapiens (Human))
National Research Institute Of Chinese Medicine
Curated by ChEMBL
LigandPNGBDBM50131042(3-Bromo-8,13-dihydro-7H-indolo[2',3':3,4]pyrido[2,...)
Affinity DataIC50:  2.47E+3nM. Assay description: Inhibition of Cytochrome P450 1A1 enzyme in bacterial membrane expressing human P450s
In DepthDetails ArticlePubMed