BDBM50131311 1-((S)-2-{(R)-2-[(Formyl-hydroxy-amino)-methyl]-hexanoylamino}-3,3-dimethyl-butyryl)-piperidine-4-carboxylic acid ethyl ester::CHEMBL329677
SMILES CCCC[C@H](CN(O)C=O)C(=O)N[C@H](C(=O)N1CCC(CC1)C(=O)OCC)C(C)(C)C
InChI Key InChIKey=BXZHBCLZYFTOAJ-QZTJIDSGSA-N
Data  1 IC50
  Tab Delimited (TSV)   2D SDfile   Computed 3D by Vconf -m prep SDfile
Find this compound or compounds like it in BindingDB:
Activity Spreadsheet -- Enzyme Inhibition Constant Data from BindingDB
Found 1 hit for monomerid = 50131311
TargetPeptide deformylase(Escherichia coli)
British Biotech Pharmaceuticals
Curated by ChEMBL
LigandPNGBDBM50131311(1-((S)-2-{(R)-2-[(Formyl-hydroxy-amino)-methyl]-he...)
Affinity DataIC50:  10nM. Assay description: Inhibition concentration against Escherichia coli peptide deformylase.
In DepthDetails ArticlePubMed