BDBM50131449 CHEMBL317730::Octadecanoic acid (2S,3R)-2-(3,4-dihydroxy-phenyl)-7,8-dihydroxy-chroman-3-yl ester
SMILES CCCCCCCCCCCCCCCCCC(=O)O[C@@H]1Cc2ccc(O)c(O)c2O[C@H]1c1ccc(O)c(O)c1
InChI Key InChIKey=YNUDMWKLPNWPCC-PPTMTGTBSA-N
Data  1 IC50
  Tab Delimited (TSV)   2D SDfile   Computed 3D by Vconf -m prep SDfile
Find this compound or compounds like it in BindingDB:
Activity Spreadsheet -- Enzyme Inhibition Constant Data from BindingDB
Found 1 hit for monomerid = 50131449
TargetXanthine dehydrogenase/oxidase(Homo sapiens (Human))
Institute Of Chemical Technology
Curated by ChEMBL
LigandPNGBDBM50131449(CHEMBL317730 | Octadecanoic acid (2S,3R)-2-(3,4-di...)
Affinity DataIC50:  1.56E+5nM. Assay description: Inhibition of Xanthine oxidase
In DepthDetails ArticlePubMed