BDBM50131515 5-(3-{3-[4-(4-tert-Butyl-phenoxy)-2-propyl-phenoxy]-propoxy}-phenyl)-thiazolidine-2,4-dione::CHEMBL1783038::CHEMBL94716
SMILES CCCc1cc(Oc2ccc(cc2)C(C)(C)C)ccc1OCCCOc1cccc(c1)-c1sc(=O)[nH]c1O
InChI Key InChIKey=VDSVCAURRGZKMM-UHFFFAOYSA-N
Data  4 IC50
  Tab Delimited (TSV)   2D SDfile   Computed 3D by Vconf -m prep SDfile
Find this compound or compounds like it in BindingDB:
Activity Spreadsheet -- Enzyme Inhibition Constant Data from BindingDB
Found 4 hits for monomerid = 50131515
TargetPeroxisome proliferator-activated receptor delta(Homo sapiens (Human))
Merck Research Laboratories
Curated by ChEMBL
LigandPNGBDBM50131515(5-(3-{3-[4-(4-tert-Butyl-phenoxy)-2-propyl-phenoxy...)
Affinity DataIC50: >5.00E+4nM. Assay description: In vitro binding affinity against human Peroxisome proliferator activated receptor delta
In DepthDetails ArticlePubMed
TargetPeroxisome proliferator-activated receptor gamma(Homo sapiens (Human))
Universiti Sains Malaysia
Curated by ChEMBL
LigandPNGBDBM50131515(5-(3-{3-[4-(4-tert-Butyl-phenoxy)-2-propyl-phenoxy...)
Affinity DataIC50:  335nM. Assay description: Displacement of radio-labeled full agonist from PPARgamma receptor
In DepthDetails ArticlePubMed
TargetPeroxisome proliferator-activated receptor gamma(Homo sapiens (Human))
Universiti Sains Malaysia
Curated by ChEMBL
LigandPNGBDBM50131515(5-(3-{3-[4-(4-tert-Butyl-phenoxy)-2-propyl-phenoxy...)
Affinity DataIC50:  335nM. Assay description: In vitro binding affinity against human peroxisome proliferator activated receptor gamma
In DepthDetails ArticlePubMed
TargetPeroxisome proliferator-activated receptor alpha(Homo sapiens (Human))
Merck Research Laboratories
Curated by ChEMBL
LigandPNGBDBM50131515(5-(3-{3-[4-(4-tert-Butyl-phenoxy)-2-propyl-phenoxy...)
Affinity DataIC50: >1.00E+4nM. Assay description: In vitro binding affinity against human Peroxisome proliferator activated receptor alpha
In DepthDetails ArticlePubMed