BDBM50131737 2-{4-Methoxy-3-[3-(4-trifluoromethyl-phenyl)-propyl]-benzyl}-butyric acid::CHEMBL262558
SMILES CCC(Cc1ccc(OC)c(CCCc2ccc(cc2)C(F)(F)F)c1)C(O)=O
InChI Key InChIKey=TYVNBJSZYWXLCK-UHFFFAOYSA-N
Data  2 EC50
  Tab Delimited (TSV)   2D SDfile   Computed 3D by Vconf -m prep SDfile
Find this compound or compounds like it in BindingDB:
Activity Spreadsheet -- Enzyme Inhibition Constant Data from BindingDB
Found 2 hits for monomerid = 50131737
TargetPeroxisome proliferator-activated receptor alpha(Homo sapiens (Human))
Kyorin Pharmaceutical
Curated by ChEMBL
LigandPNGBDBM50131737(2-{4-Methoxy-3-[3-(4-trifluoromethyl-phenyl)-propy...)
Affinity DataEC50:  860nM. Assay description: In vitro effective concentration for agonist activity on human Peroxisome proliferator activated receptor alpha-Gal4 chimeric receptor in transfected...
In DepthDetails ArticlePubMed
TargetPeroxisome proliferator-activated receptor delta(Homo sapiens (Human))
Kyorin Pharmaceutical
Curated by ChEMBL
LigandPNGBDBM50131737(2-{4-Methoxy-3-[3-(4-trifluoromethyl-phenyl)-propy...)
Affinity DataEC50:  640nM. Assay description: Agonist activity on Gal4 chimeric human Peroxisome proliferator activated receptor delta expressed in CHO-K1 cells
In DepthDetails ArticlePubMed