BDBM50131759 CHEMBL3633868
SMILES [Cl-].COc1cccc2cc(oc12)C(=O)\C=C\c1ccc[n+](Cc2cccc(Cl)c2Cl)c1
InChI Key InChIKey=MPCQVMJYBZEYEN-ASTDGNLGSA-M
Data  1 IC50
  Tab Delimited (TSV)   2D SDfile   Computed 3D by Vconf -m prep SDfile
Find this compound or compounds like it in BindingDB:
Activity Spreadsheet -- Enzyme Inhibition Constant Data from BindingDB
Found 1 hit for monomerid = 50131759
TargetAcetylcholinesterase(Tetronarce californica (Pacific electric ray) (Tor...)
Alzahra University
Curated by ChEMBL
LigandPNGBDBM50131759(CHEMBL3633868)
Affinity DataIC50:  985nM. Assay description: Inhibition of Torpedo californica AChE (type VI-S) using acetylthiocholine iodide as substrate assessed as 5-thio-2-nitrobenzoate anion formation pre...
In DepthDetails ArticlePubMed