BDBM50132178 5-[(3-Isopropyl-1H-pyrazolo[4,3-d]pyrimidin-7-ylamino)-methyl]-2-methoxy-phenol::CHEMBL322182
SMILES COc1ccc(CNc2ncnc3c([nH]nc23)C(C)C)cc1O
InChI Key InChIKey=HQQQZRZVXWMIEP-UHFFFAOYSA-N
Data  2 IC50
  Tab Delimited (TSV)   2D SDfile   Computed 3D by Vconf -m prep SDfile
Find this compound or compounds like it in BindingDB:
Activity Spreadsheet -- Enzyme Inhibition Constant Data from BindingDB
Found 2 hits for monomerid = 50132178
LigandPNGBDBM50132178(5-[(3-Isopropyl-1H-pyrazolo[4,3-d]pyrimidin-7-ylam...)
Affinity DataIC50:  2.60E+4nM. Assay description: Inhibitory concentration against Cyclin-dependent kinase 1-cyclin B
In DepthDetails ArticlePubMed
LigandPNGBDBM50132178(5-[(3-Isopropyl-1H-pyrazolo[4,3-d]pyrimidin-7-ylam...)
Affinity DataIC50:  1.10E+3nM. Assay description: Inhibitory concentration against Cyclin-dependent kinase 1-cyclin B
In DepthDetails ArticlePubMed