BDBM50132256 CHEMBL102986::N-[4-(5-Methyl-2,4-dioxo-3,4-dihydro-2H-pyrimidin-1-yl)-but-2-enyl]-2,2-diphenyl-acetamide
SMILES Cc1cn(C\C=C/CNC(=O)C(c2ccccc2)c2ccccc2)c(=O)[nH]c1=O
InChI Key InChIKey=NDILRUMMGDBGQL-HJWRWDBZSA-N
Data  2 IC50
  Tab Delimited (TSV)   2D SDfile   Computed 3D by Vconf -m prep SDfile
Find this compound or compounds like it in BindingDB:
Activity Spreadsheet -- Enzyme Inhibition Constant Data from BindingDB
Found 2 hits for monomerid = 50132256
TargetThymidine kinase, cytosolic(Homo sapiens (Human))
Instituto De QuíMica MéDica (Csic)
Curated by ChEMBL
LigandPNGBDBM50132256(CHEMBL102986 | N-[4-(5-Methyl-2,4-dioxo-3,4-dihydr...)
Affinity DataIC50:  1.15E+5nM. Assay description: Inhibitory concentration of the compound on phosphorylation of [methyl-3H]-dTh by human Thymidine Kinase 1
In DepthDetails ArticlePubMed
TargetThymidine kinase, cytosolic(Homo sapiens (Human))
Instituto De QuíMica MéDica (Csic)
Curated by ChEMBL
LigandPNGBDBM50132256(CHEMBL102986 | N-[4-(5-Methyl-2,4-dioxo-3,4-dihydr...)
Affinity DataIC50:  2.70E+4nM. Assay description: Inhibitory concentration of the compound on phosphorylation of [methyl-3H]-dTh by human Thymidine Kinase 2
In DepthDetails ArticlePubMed