BDBM50132416 1-[5-tert-Butyl-2-(3-dimethylaminomethyl-4-methyl-phenyl)-2H-pyrazol-3-yl]-3-[4-(2-morpholin-4-yl-ethoxy)-naphthalen-1-yl]-urea::CHEMBL106115
SMILES CN(C)Cc1cc(ccc1C)-n1nc(cc1NC(=O)Nc1ccc(OCCN2CCOCC2)c2ccccc12)C(C)(C)C
InChI Key InChIKey=ODYQQLBOZJWPOI-UHFFFAOYSA-N
Data  1 Kd  1 Koff  1 Kon
  Tab Delimited (TSV)   2D SDfile   Computed 3D by Vconf -m prep SDfile
Find this compound or compounds like it in BindingDB:
Activity Spreadsheet -- Enzyme Inhibition Constant Data from BindingDB
Found 3 hits for monomerid = 50132416
TargetMitogen-activated protein kinase 14(Homo sapiens (Human))
Boehringer Ingelheim Pharmaceuticals
Curated by ChEMBL
LigandPNGBDBM50132416(1-[5-tert-Butyl-2-(3-dimethylaminomethyl-4-methyl-...)
Affinity DataKon:  0.0000380M-1s-1Assay Description:Binding affinity for Mitogen-activated protein kinase p38 alpha
In DepthDetails ArticlePubMed
TargetMitogen-activated protein kinase 14(Homo sapiens (Human))
Boehringer Ingelheim Pharmaceuticals
Curated by ChEMBL
LigandPNGBDBM50132416(1-[5-tert-Butyl-2-(3-dimethylaminomethyl-4-methyl-...)
Affinity DataKd:  4.80nM. Assay description: Binding affinity for Mitogen-activated protein kinase p38 alpha
In DepthDetails ArticlePubMed
TargetMitogen-activated protein kinase 14(Homo sapiens (Human))
Boehringer Ingelheim Pharmaceuticals
Curated by ChEMBL
LigandPNGBDBM50132416(1-[5-tert-Butyl-2-(3-dimethylaminomethyl-4-methyl-...)
Affinity DataKoff:  7.90E+3s-1Assay Description:Binding affinity for Mitogen-activated protein kinase p38 alpha
In DepthDetails ArticlePubMed