BDBM50132778 CHEMBL3634426
SMILES Cc1ccoc1C(=O)Nc1ccc(N2C(=O)c3ccccc3C2=O)c(c1)C(F)(F)F
InChI Key InChIKey=KWWIRYRJWPPZAG-UHFFFAOYSA-N
Data  1 IC50  2 EC50
  Tab Delimited (TSV)   2D SDfile   Computed 3D by Vconf -m prep SDfile
Find this compound or compounds like it in BindingDB:
Activity Spreadsheet -- Enzyme Inhibition Constant Data from BindingDB
Found 3 hits for monomerid = 50132778
TargetMetabotropic glutamate receptor 1(Homo sapiens (Human))
Vanderbilt University Medical Center
Curated by ChEMBL
LigandPNGBDBM50132778(CHEMBL3634426)
Affinity DataEC50:  123nM. Assay description: Displacement of [125I]NPY from human NPY1 receptor expressed in CHO cells
In DepthDetails ArticlePubMed
TargetMetabotropic glutamate receptor 4(Homo sapiens (Human))
Vanderbilt University Medical Center
Curated by ChEMBL
LigandPNGBDBM50132778(CHEMBL3634426)
Affinity DataEC50:  6.66E+3nM. Assay description: Positive allosteric modulation of human mGluR4 by calcium mobilization assay
In DepthDetails ArticlePubMed
TargetMetabotropic glutamate receptor 1(Homo sapiens (Human))
Vanderbilt University Medical Center
Curated by ChEMBL
LigandPNGBDBM50132778(CHEMBL3634426)
Affinity DataIC50:  123nM. Assay description: Positive allosteric modulation of human mGluR1 by calcium mobilization assay
In DepthDetails ArticlePubMed