BDBM50132779 CHEMBL3634425
SMILES Cc1ccoc1C(=O)Nc1ccc(N2C(=O)c3cccc(F)c3C2=O)c(C)c1
InChI Key InChIKey=PSIQSWXUYHNQBQ-UHFFFAOYSA-N
Data  1 IC50  2 EC50
  Tab Delimited (TSV)   2D SDfile   Computed 3D by Vconf -m prep SDfile
Find this compound or compounds like it in BindingDB:
Activity Spreadsheet -- Enzyme Inhibition Constant Data from BindingDB
Found 3 hits for monomerid = 50132779
TargetMetabotropic glutamate receptor 1(Homo sapiens (Human))
Vanderbilt University Medical Center
Curated by ChEMBL
LigandPNGBDBM50132779(CHEMBL3634425)
Affinity DataEC50:  49nM. Assay description: Agonist activity at human NPY4 receptor in HEK293 cells by inhibition of forskolin-stimulated cAMP synthesis
In DepthDetails ArticlePubMed
TargetMetabotropic glutamate receptor 4(Homo sapiens (Human))
Vanderbilt University Medical Center
Curated by ChEMBL
LigandPNGBDBM50132779(CHEMBL3634425)
Affinity DataEC50:  1.10E+3nM. Assay description: Positive allosteric modulation of human mGluR4 by calcium mobilization assay
In DepthDetails ArticlePubMed
TargetMetabotropic glutamate receptor 1(Homo sapiens (Human))
Vanderbilt University Medical Center
Curated by ChEMBL
LigandPNGBDBM50132779(CHEMBL3634425)
Affinity DataIC50:  49nM. Assay description: Positive allosteric modulation of human mGluR1 by calcium mobilization assay
In DepthDetails ArticlePubMed