BDBM50133197 CHEMBL335846::Compound KK13
SMILES CC(C)C[C@H](NC(=O)[C@@H](NC(=O)[C@H](Cc1ccc(O)cc1)NC(=O)[C@@H]1CCCN1C(=O)[C@@H](N)CCCN=C(N)NC(=O)[C@@H](N)CCCCCN)C(C)(C)C)C(O)=O
InChI Key InChIKey=NWHUBNGSOHGYBR-MWCICDNOSA-N
Data  3 IC50
  Tab Delimited (TSV)   2D SDfile   Computed 3D by Vconf -m prep SDfile
Find this compound or compounds like it in BindingDB:
Activity Spreadsheet -- Enzyme Inhibition Constant Data from BindingDB
Found 3 hits for monomerid = 50133197
TargetSortilin(Homo sapiens (Human))
Medical University Of South Carolina
Curated by ChEMBL
LigandPNGBDBM50133197(CHEMBL335846 | Compound KK13)
Affinity DataIC50:  4.00E+3nM. Assay description: Evaluated for binding affinity by inhibiting binding of [125I]Tyr(3)-NT to human Neurotensin receptor 3
In DepthDetails ArticlePubMed
TargetNeurotensin receptor type 1(Homo sapiens (Human))
Medical University Of South Carolina
Curated by ChEMBL
LigandPNGBDBM50133197(CHEMBL335846 | Compound KK13)
Affinity DataIC50:  5.71nM. Assay description: Evaluated for binding affinity by inhibiting binding of [125I]-Tyr(3)-NT to human Neurotensin receptor 1
In DepthDetails ArticlePubMed
TargetNeurotensin receptor type 2(Homo sapiens (Human))
Medical University Of South Carolina
Curated by ChEMBL
LigandPNGBDBM50133197(CHEMBL335846 | Compound KK13)
Affinity DataIC50:  11.1nM. Assay description: Evaluated for binding affinity by inhibiting binding of [125I]Tyr(3)-NT to human Neurotensin receptor 2
In DepthDetails ArticlePubMed