BDBM50133225 10-methoxy-4,13-dimethyl-17-(3-phenylpropoxy)-12-oxa-4-azapentacyclo[9.6.1.01,13.05,17.07,18]octadeca-7(18),8,10,15-tetraen-14-one::CHEMBL134067
SMILES CCC[C@]12c3c4O[C@@]1(C)C(=O)C=C[C@@]2(OCCCc1ccccc1)C(Cc3ccc4OC)NC
InChI Key InChIKey=JIZBEENYXGKATF-PCYNRASCSA-N
Data  3 KI
  Tab Delimited (TSV)   2D SDfile   Computed 3D by Vconf -m prep SDfile
Find this compound or compounds like it in BindingDB:
Activity Spreadsheet -- Enzyme Inhibition Constant Data from BindingDB
Found 3 hits for monomerid = 50133225
TargetMu-type opioid receptor(Rattus norvegicus (rat))
University Of Innsbruck
Curated by ChEMBL
LigandPNGBDBM50133225(10-methoxy-4,13-dimethyl-17-(3-phenylpropoxy)-12-o...)
Affinity DataKi:  0.620nM. Assay description: Binding affinity against Opioid receptor mu 1 isolated from rat brain membarane was determined using [3H]DAMGO as radioligand
In DepthDetails ArticlePubMed
TargetDelta-type opioid receptor(Rattus norvegicus (rat))
University Of Innsbruck
Curated by ChEMBL
LigandPNGBDBM50133225(10-methoxy-4,13-dimethyl-17-(3-phenylpropoxy)-12-o...)
Affinity DataKi:  6.33nM. Assay description: Binding affinity against Opioid receptor delta 1 isolated from rat brain membarane was determined using [3H][Ile]-deltorphin as radioligand
In DepthDetails ArticlePubMed
TargetKappa-type opioid receptor(Rattus norvegicus (rat))
University Of Innsbruck
Curated by ChEMBL
LigandPNGBDBM50133225(10-methoxy-4,13-dimethyl-17-(3-phenylpropoxy)-12-o...)
Affinity DataKi:  25nM. Assay description: Binding affinity against Opioid receptor kappa 1 isolated from rat brain membarane was determined using [3H]U-69593 as radioligand
In DepthDetails ArticlePubMed