BDBM50133593 CHEMBL3261712
SMILES [#6]-[#8]-c1c(-[#8]-[#6]-[#6]=[#6])cc2oc3cc(-[#8])c(-[#6]\[#6]=[#6](\[#6])-[#6])c(-[#8])c3c(=O)c2c1-[#6]\[#6]=[#6](\[#6])-[#6]
InChI Key InChIKey=KDNYPMYPMYDENX-UHFFFAOYSA-N
Data  1 KI
  Tab Delimited (TSV)   2D SDfile   Computed 3D by Vconf -m prep SDfile
Find this compound or compounds like it in BindingDB:
Activity Spreadsheet -- Enzyme Inhibition Constant Data from BindingDB
Found 1 hit for monomerid = 50133593
TargetIsocitrate dehydrogenase [NADP] cytoplasmic(Homo sapiens (Human))
Dongguk University
Curated by ChEMBL
LigandPNGBDBM50133593(CHEMBL3261712)
Affinity DataKi:  1.74E+4nM. Assay description: Competitive inhibition of IDH1-R132H mutant (unknown origin) using a-ketoglutarate and NADPH as substrate by steady state kinetic analysis
In DepthDetails ArticlePubMed