BDBM50133624 (3Z)-5-fluoro-1H-indole-2,3-dione 3-thiosemicarbazone::CHEMBL119756
SMILES NC(=S)N=Nc1c(O)[nH]c2ccc(F)cc12
InChI Key InChIKey=RSUWLJIANWBTGS-UHFFFAOYSA-N
Data  3 IC50
  Tab Delimited (TSV)   2D SDfile   Computed 3D by Vconf -m prep SDfile
Find this compound or compounds like it in BindingDB:
Activity Spreadsheet -- Enzyme Inhibition Constant Data from BindingDB
Found 3 hits for monomerid = 50133624
TargetCruzipain(Trypanosoma cruzi)
University Of Cape Town
Curated by ChEMBL
LigandPNGBDBM50133624((3Z)-5-fluoro-1H-indole-2,3-dione 3-thiosemicarbaz...)
Affinity DataIC50:  3.00E+4nM. Assay description: Inhibitory activity against the Trypanosoma cruzi cysteine protease cruzain
In DepthDetails ArticlePubMed
TargetCruzipain(Trypanosoma cruzi)
University Of Cape Town
Curated by ChEMBL
LigandPNGBDBM50133624((3Z)-5-fluoro-1H-indole-2,3-dione 3-thiosemicarbaz...)
Affinity DataIC50:  1.50E+4nM. Assay description: Inhibitory activity against T. brucei rhodensiense cysteine protease rhodesain
In DepthDetails ArticlePubMed
TargetFalcipain 2(Plasmodium falciparum)
University Of Cape Town
Curated by ChEMBL
LigandPNGBDBM50133624((3Z)-5-fluoro-1H-indole-2,3-dione 3-thiosemicarbaz...)
Affinity DataIC50:  3.86E+4nM. Assay description: Inhibitory activity was tested against Falcipain-2
In DepthDetails ArticlePubMed