BDBM50133869 CHEMBL3633800
SMILES COc1cc(F)ccc1-n1c(SCC(=O)Nc2nc3ccc(C)cc3s2)nc2CCSc2c1=O
InChI Key InChIKey=RIVSGEWCBGGFHU-UHFFFAOYSA-N
Data  1 IC50
  Tab Delimited (TSV)   2D SDfile   Computed 3D by Vconf -m prep SDfile
Find this compound or compounds like it in BindingDB:
Activity Spreadsheet -- Enzyme Inhibition Constant Data from BindingDB
Found 1 hit for monomerid = 50133869
TargetProtein-serine O-palmitoleoyltransferase porcupine(Homo sapiens (Human))
Experimental Therapeutics Centre
Curated by ChEMBL
LigandPNGBDBM50133869(CHEMBL3633800)
Affinity DataIC50:  27nM. Assay description: Inhibition of porcupine activity (unknown origin) expressed in human HT1080 cells assessed as suppression of Wnt3A-mediated super top flash activity ...
In DepthDetails ArticlePubMed