BDBM50134094 (3aR,10S)-2-Butyl-10-phenyl-3a,4,9,10-tetrahydro-2,9,10a-triaza-cyclopenta[b]fluorene-1,3-dione::CHEMBL336457::Trans-2-Butyl-10-phenyl-3a,4,9,10-tetrahydro-2,9,10a-triaza-cyclopenta[b]fluorene-1,3-dione
SMILES CCCCn1c(O)c2Cc3c([nH]c4ccccc34)[C@H](c3ccccc3)n2c1=O
InChI Key InChIKey=JETUAPJRWQHIOG-NRFANRHFSA-N
Data  2 IC50
  Tab Delimited (TSV)   2D SDfile   Computed 3D by Vconf -m prep SDfile
Find this compound or compounds like it in BindingDB:
Activity Spreadsheet -- Enzyme Inhibition Constant Data from BindingDB
Found 2 hits for monomerid = 50134094
TargetcGMP-specific 3',5'-cyclic phosphodiesterase(Bos taurus)
Glaxosmithkline
Curated by ChEMBL
LigandPNGBDBM50134094((3aR,10S)-2-Butyl-10-phenyl-3a,4,9,10-tetrahydro-2...)
Affinity DataIC50:  20nM. Assay description: Inhibitory activity against bovine PDE5 (phosphodiesterase-5).
In DepthDetails ArticlePubMed
TargetcGMP-specific 3',5'-cyclic phosphodiesterase(Homo sapiens (Human))
Universidade Federal De Lavras-Ufla
Curated by ChEMBL
LigandPNGBDBM50134094((3aR,10S)-2-Butyl-10-phenyl-3a,4,9,10-tetrahydro-2...)
Affinity DataIC50:  20nM. Assay description: Inhibition of PDE5
In DepthDetails ArticlePubMed