BDBM50134106 (3aR,10S)-10-(4-Methoxy-phenyl)-2-(2-pyridin-2-yl-ethyl)-3a,4,9,10-tetrahydro-2,9,10a-triaza-cyclopenta[b]fluorene-1,3-dione::CHEMBL140874
SMILES COc1ccc(cc1)[C@H]1c2[nH]c3ccccc3c2Cc2c(O)n(CCc3ccccn3)c(=O)n12
InChI Key InChIKey=OTOWOJVTYWUQSR-VWLOTQADSA-N
Data  1 IC50
  Tab Delimited (TSV)   2D SDfile   Computed 3D by Vconf -m prep SDfile
Find this compound or compounds like it in BindingDB:
Activity Spreadsheet -- Enzyme Inhibition Constant Data from BindingDB
Found 1 hit for monomerid = 50134106
TargetcGMP-specific 3',5'-cyclic phosphodiesterase(Bos taurus)
Glaxosmithkline
Curated by ChEMBL
LigandPNGBDBM50134106((3aR,10S)-10-(4-Methoxy-phenyl)-2-(2-pyridin-2-yl-...)
Affinity DataIC50:  6nM. Assay description: Inhibitory activity against bovine PDE5 (phosphodiesterase-5).
In DepthDetails ArticlePubMed