BDBM50134272 CHEMBL3746278
SMILES C[C@H](N(Cc1ccc(cc1)-c1cccc(F)c1)S(C)(=O)=O)C(=O)N[C@@H](CC(N)=O)C#N
InChI Key InChIKey=JHVAHEHLMLLUBK-LIRRHRJNSA-N
Data  1 IC50
  Tab Delimited (TSV)   2D SDfile   Computed 3D by Vconf -m prep SDfile
Find this compound or compounds like it in BindingDB:
Activity Spreadsheet -- Enzyme Inhibition Constant Data from BindingDB
Found 1 hit for monomerid = 50134272
TargetLegumain(Homo sapiens (Human))
Queen'S University Belfast
Curated by ChEMBL
LigandPNGBDBM50134272(CHEMBL3746278)
Affinity DataIC50:  128nM. Assay description: Inhibition of recombinant human legumain using Z-Ala-Ala-Asn-MCA as substrate preincubated with protein followed by substrate addition measured every...
In DepthDetails ArticlePubMed