BDBM50134274 CHEMBL3746491
SMILES C[C@H](N(Cc1ccc(cc1)-c1ccc(F)cc1)S(C)(=O)=O)C(=O)N[C@@H](CC(N)=O)C#N
InChI Key InChIKey=LNBVKMYDYKCHPR-LIRRHRJNSA-N
Data  1 IC50
  Tab Delimited (TSV)   2D SDfile   Computed 3D by Vconf -m prep SDfile
Find this compound or compounds like it in BindingDB:
Activity Spreadsheet -- Enzyme Inhibition Constant Data from BindingDB
Found 1 hit for monomerid = 50134274
TargetLegumain(Homo sapiens (Human))
Queen'S University Belfast
Curated by ChEMBL
LigandPNGBDBM50134274(CHEMBL3746491)
Affinity DataIC50:  1.04E+3nM. Assay description: Inhibition of recombinant human legumain using Z-Ala-Ala-Asn-MCA as substrate preincubated with protein followed by substrate addition measured every...
In DepthDetails ArticlePubMed