BDBM50134350 5-Benzyl-4-hydroxy-3,5-dimethyl-5H-thiophen-2-one::5-benzyl-3,5-dimethyl-4-hydroxy-5H-thiophen-2-one::CHEMBL123876
SMILES CC1C(=O)SC(C)(Cc2ccccc2)C1=O
InChI Key InChIKey=IXQWROUKKBPBRI-UHFFFAOYSA-N
Data  1 IC50
  Tab Delimited (TSV)   2D SDfile   Computed 3D by Vconf -m prep SDfile
Find this compound or compounds like it in BindingDB:
Activity Spreadsheet -- Enzyme Inhibition Constant Data from BindingDB
Found 1 hit for monomerid = 50134350
Target3-oxoacyl-[acyl-carrier-protein] synthase 3(Mycobacterium tuberculosis)
The University Of Birmingham
Curated by ChEMBL
LigandPNGBDBM50134350(5-Benzyl-4-hydroxy-3,5-dimethyl-5H-thiophen-2-one ...)
Affinity DataIC50: >2.50E+5nM. Assay description: In vitro inhibitory activity against the recombinant Mycobacterium tuberculosis Beta-ketoacyl-ACP synthase III mtFabH condensing enzyme.
In DepthDetails ArticlePubMed