BDBM50134455 CHEMBL3747522
SMILES Fc1ccc(cc1)N1CCn2nc(COc3ccccn3)cc2C1=O
InChI Key InChIKey=ZCRSCDRPLPELFZ-UHFFFAOYSA-N
Data  3 EC50
  Tab Delimited (TSV)   2D SDfile   Computed 3D by Vconf -m prep SDfile
Find this compound or compounds like it in BindingDB:
Activity Spreadsheet -- Enzyme Inhibition Constant Data from BindingDB
Found 3 hits for monomerid = 50134455
TargetMetabotropic glutamate receptor 5(Homo sapiens (Human))
Janssen Pharmaceutica
Curated by ChEMBL
LigandPNGBDBM50134455(CHEMBL3747522)
Affinity DataEC50:  490nM. Assay description: Positive allosteric modulation of human mGlu5 expressed in HEK293 cells assessed as glutamate-induced calcium mobilization
In DepthDetails ArticlePubMed
TargetMetabotropic glutamate receptor 3(Homo sapiens (Human))
Janssen Pharmaceutica
Curated by ChEMBL
LigandPNGBDBM50134455(CHEMBL3747522)
Affinity DataEC50:  290nM. Assay description: Antagonist activity at human mGlu3 expressed in HEK293 cells assessed as inhibition of glutamate-induced calcium mobilization
In DepthDetails ArticlePubMed
TargetMetabotropic glutamate receptor 5(Homo sapiens (Human))
Janssen Pharmaceutica
Curated by ChEMBL
LigandPNGBDBM50134455(CHEMBL3747522)
Affinity DataEC50:  490nM. Assay description: Positive allosteric modulation of human mGlu5 expressed in HEK293 cells assessed as glutamate-induced calcium mobilization
In DepthDetails ArticlePubMed