BDBM50134674 CHEMBL3747747::US9637484, 8
SMILES OC(=O)C1(CCC1)Sc1ccnc2ccc(cc12)-c1cccc(c1)C(F)(F)F
InChI Key InChIKey=JJNMSSOOUCYJLO-UHFFFAOYSA-N
Data  2 IC50
  Tab Delimited (TSV)   2D SDfile   Computed 3D by Vconf -m prep SDfile
Find this compound or compounds like it in BindingDB:
Activity Spreadsheet -- Enzyme Inhibition Constant Data from BindingDB
Found 2 hits for monomerid = 50134674
TargetSolute carrier family 22 member 12(Homo sapiens (Human))
Shanghai Hengrui Pharmaceutical
US Patent
LigandPNGBDBM50134674(CHEMBL3747747 | US9637484, 8)
Affinity DataIC50:  359nM. Assay description: In vitro URAT1 assay can be used to identify compounds having potential activity for decreasing serum uric acid. In a suitable test, the vectors that...
In DepthDetails US Patent
TargetSolute carrier family 22 member 12(Homo sapiens (Human))
Shanghai Hengrui Pharmaceutical
US Patent
LigandPNGBDBM50134674(CHEMBL3747747 | US9637484, 8)
Affinity DataIC50:  359nM. Assay description: Inhibition of human URAT1 expressed in HEK293 cells assessed as [14C]uric acid uptake after 12 mins by scintillation counter
In DepthDetails ArticlePubMed