BDBM50134738 (3S,10S,13S,17S)-17-(1-Hydroxy-1-pyridin-3-yl-ethyl)-10,13-dimethyl-hexadecahydro-cyclopenta[a]phenanthren-3-ol::CHEMBL143478
SMILES CC(O)([C@H]1CCC2C3CCC4C[C@@H](O)CC[C@]4(C)C3CC[C@]12C)c1cccnc1
InChI Key InChIKey=XBCVHCKFMPQDSV-OZEVTANXSA-N
Data  1 IC50
  Tab Delimited (TSV)   2D SDfile   Computed 3D by Vconf -m prep SDfile
Find this compound or compounds like it in BindingDB:
Activity Spreadsheet -- Enzyme Inhibition Constant Data from BindingDB
Found 1 hit for monomerid = 50134738
TargetCycloartenol-C-24-methyltransferase(Arabidopsis thaliana)
Cardiff University
Curated by ChEMBL
LigandPNGBDBM50134738((3S,10S,13S,17S)-17-(1-Hydroxy-1-pyridin-3-yl-ethy...)
Affinity DataIC50:  3.85E+4nM. Assay description: In vitro inhibitory concentration against L. major Sterol 24-C-methyltransferase (24-SMT)
In DepthDetails ArticlePubMed