BDBM50134790 CHEMBL3754247
SMILES CC(C)n1nc(-c2cc(on2)-c2ccccn2)c2c(N)ncnc12
InChI Key InChIKey=OGYKRHXGMVISFY-UHFFFAOYSA-N
Data  2 IC50
  Tab Delimited (TSV)   2D SDfile   Computed 3D by Vconf -m prep SDfile
Find this compound or compounds like it in BindingDB:
Activity Spreadsheet -- Enzyme Inhibition Constant Data from BindingDB
Found 2 hits for monomerid = 50134790
TargetProto-oncogene tyrosine-protein kinase receptor Ret(Homo sapiens (Human))
Korea Institute Of Science And Technology (Kist)
Curated by ChEMBL
LigandPNGBDBM50134790(CHEMBL3754247)
Affinity DataIC50:  910nM. Assay description: Inhibition of human wild type RET by radiometric assay in presence of [gamma-33P]-ATP
In DepthDetails ArticlePubMed
TargetProto-oncogene tyrosine-protein kinase receptor Ret(Homo sapiens (Human))
Korea Institute Of Science And Technology (Kist)
Curated by ChEMBL
LigandPNGBDBM50134790(CHEMBL3754247)
Affinity DataIC50:  5.88E+3nM. Assay description: Inhibition of human Ret V804M mutant by radiometric assay in presence of [gamma-33P]-ATP
In DepthDetails ArticlePubMed