BDBM50134825 3-(4-Methanesulfonyl-phenyl)-4-phenyl-6-propylsulfanyl-pyran-2-one::CHEMBL143779
SMILES CCCSc1cc(-c2ccccc2)c(-c2ccc(cc2)S(C)(=O)=O)c(=O)o1
InChI Key InChIKey=RYDCKTDRWUDOFI-UHFFFAOYSA-N
Data  2 IC50
  Tab Delimited (TSV)   2D SDfile   Computed 3D by Vconf -m prep SDfile
Find this compound or compounds like it in BindingDB:
Activity Spreadsheet -- Enzyme Inhibition Constant Data from BindingDB
Found 2 hits for monomerid = 50134825
TargetProstaglandin G/H synthase 2(Bos taurus)
University Of Alberta
Curated by ChEMBL
LigandPNGBDBM50134825(3-(4-Methanesulfonyl-phenyl)-4-phenyl-6-propylsulf...)
Affinity DataIC50: >1.00E+5nM. Assay description: In vitro inhibitory activity against prostaglandin G/H synthase 2 (COX-2)
In DepthDetails ArticlePubMed
TargetProstaglandin G/H synthase 1(Ovis aries (Sheep))
University Of Alberta
Curated by ChEMBL
LigandPNGBDBM50134825(3-(4-Methanesulfonyl-phenyl)-4-phenyl-6-propylsulf...)
Affinity DataIC50: >1.00E+5nM. Assay description: In vitro inhibitory activity against Prostaglandin G/H synthase 1 (COX-1)
In DepthDetails ArticlePubMed