BDBM50135111 CHEMBL3739684
SMILES CCCc1cccc2c(n[nH]c12)-c1cnc(s1)-c1ccc(nc1)C(=O)NCCN1CCCCC1
InChI Key InChIKey=FSHYFKNMIPAWGN-UHFFFAOYSA-N
Data  1 IC50
  Tab Delimited (TSV)   2D SDfile   Computed 3D by Vconf -m prep SDfile
Find this compound or compounds like it in BindingDB:
Activity Spreadsheet -- Enzyme Inhibition Constant Data from BindingDB
Found 1 hit for monomerid = 50135111
TargetDNA gyrase subunit B(Staphylococcus aureus)
Cubist Pharmaceuticals
Curated by ChEMBL
LigandPNGBDBM50135111(CHEMBL3739684)
Affinity DataIC50:  20nM. Assay description: Inhibition of Staphylococcus aureus Gyrase B ATPase activity by fluorescence analysis
In DepthDetails ArticlePubMed