BDBM50135165 (+)-gallocatechin::(2R,3S)-2-(3,4,5-Trihydroxy-phenyl)-chroman-3,5,7-triol::CHEMBL125743
SMILES O[C@H]1Cc2c(O)cc(O)cc2O[C@@H]1c1cc(O)c(O)c(O)c1
InChI Key InChIKey=XMOCLSLCDHWDHP-SWLSCSKDSA-N
Data  1 KI  5 IC50
  Tab Delimited (TSV)   2D SDfile   Computed 3D by Vconf -m prep SDfile
Find this compound or compounds like it in BindingDB:
Activity Spreadsheet -- Enzyme Inhibition Constant Data from BindingDB
Found 6 hits for monomerid = 50135165
TargetApoptosis regulator Bcl-2(Homo sapiens (Human))TBA
LigandPNGBDBM50135165((+)-gallocatechin | (2R,3S)-2-(3,4,5-Trihydroxy-ph...)
Affinity DataKi: >1.00E+5nM. Assay description: Displacement of NLWAAQRYGRELRRMSD-K(FITC)-FVD from Bcl-2 (unknown origin) by fluorescence polarization assay
In DepthDetails Article
TargetMitogen-activated protein kinase 10(Homo sapiens (Human))
Eberhard Karls University Of Tuebingen
LigandPNGBDBM50135165((+)-gallocatechin | (2R,3S)-2-(3,4,5-Trihydroxy-ph...)
Affinity DataIC50:  5.30E+3nMT: 2°C. Assay description: The p38alpha reaction was carried out by using kinase (12ng per well), ATP (100uM) and incubated for 60 min at 37 C. For the JNK3 assay, kinase (10n...
In DepthDetails ArticlePubMed
TargetAlpha-synuclein(Homo sapiens (Human))
Universit£
Curated by ChEMBL
LigandPNGBDBM50135165((+)-gallocatechin | (2R,3S)-2-(3,4,5-Trihydroxy-ph...)
Affinity DataIC50:  8.90E+3nM. Assay description: Inhibition of human alpha-synuclein filament formation expressed in Escherichia coli BL21(DE3) cells incubated for 72 hrs by thioflavin S based fluor...
In DepthDetails ArticlePubMed
TargetProstaglandin G/H synthase 1(Homo sapiens (Human))
Uppsala University
Curated by ChEMBL
LigandPNGBDBM50135165((+)-gallocatechin | (2R,3S)-2-(3,4,5-Trihydroxy-ph...)
Affinity DataIC50:  9.50E+4nM. Assay description: Inhibition of COX1
In DepthDetails ArticlePubMed
TargetMitogen-activated protein kinase 14(Homo sapiens (Human))
Eberhard Karls University Of Tuebingen
LigandPNGBDBM50135165((+)-gallocatechin | (2R,3S)-2-(3,4,5-Trihydroxy-ph...)
Affinity DataIC50:  3.53E+3nMT: 2°C. Assay description: The p38alpha reaction was carried out by using kinase (12ng per well), ATP (100uM) and incubated for 60 min at 37 C. For the JNK3 assay, kinase (10n...
In DepthDetails ArticlePubMed
TargetBeta-secretase 1(Homo sapiens (Human))
Kyungpook National University
Curated by ChEMBL
LigandPNGBDBM50135165((+)-gallocatechin | (2R,3S)-2-(3,4,5-Trihydroxy-ph...)
Affinity DataIC50:  2.50E+3nM. Assay description: Inhibition of human Beta-secretase 1
In DepthDetails ArticlePubMed